BDBM451122 US10676485, Example 32
SMILES CN1CCN(C[C@@H]2COc3ccc(OCc4ccnc(n4)[C@H]4CC[C@@H](CC4)OCC4COCCO4)c(C[C@@H](Oc4ncnc5sc(C6=CCCC6)c(-c6c(C)c(Cl)c(O2)c(Cl)c6C)c45)C(O)=O)c3)CC1
InChI Key InChIKey=UQWQSWYCZFZPJE-QYPHUZLNSA-N
Data  2 KI
  Tab Delimited (TSV)   2D SDfile   Computed 3D by Vconf -m prep SDfile
Find this compound or compounds like it in BindingDB:
Activity Spreadsheet -- Enzyme Inhibition Constant Data from BindingDB
Found 2 hits for monomerid = 451122
TargetInduced myeloid leukemia cell differentiation protein Mcl-1(Homo sapiens (Human))
Abbvie
US Patent
LigandPNGBDBM451122(US10676485, Example 32)
Affinity DataKi:  0.0220nM. Assay description: The ability of the exemplary MCL-1 inhibitors of Examples 1 through 151 to bind MCL-1 was demonstrated using the Time Resolved-Fluorescence Resonance...
Ligand InfoPC cidPC sid
In DepthDetails US Patent
TargetInduced myeloid leukemia cell differentiation protein Mcl-1(Homo sapiens (Human))
Abbvie
US Patent
LigandPNGBDBM451122(US10676485, Example 32)
Affinity DataKi:  0.270nM. Assay description: The ability of the exemplary MCL-1 inhibitors of Examples 1 through 151 to bind MCL-1 was demonstrated using the Time Resolved-Fluorescence Resonance...
Ligand InfoPC cidPC sid
In DepthDetails US Patent