BDBM451429 US10710967, Example 24
SMILES CC(C)C(=O)NCc1ccc(Cl)c(c1)-c1nc(cc(=O)[nH]1)-c1ccc(OC(F)(F)F)cc1
InChI Key InChIKey=RTOKDBKMYGZKAD-UHFFFAOYSA-N
Data  1 IC50
  Tab Delimited (TSV)   2D SDfile   Computed 3D by Vconf -m prep SDfile
Find this compound or compounds like it in BindingDB:
Activity Spreadsheet -- Enzyme Inhibition Constant Data from BindingDB
Found 1 hit for monomerid = 451429
TargetProstaglandin E synthase(Homo sapiens (Human))
Aska Pharmaceutical
US Patent
LigandPNGBDBM451429(US10710967, Example 24)
Affinity DataIC50:  0.310nM. Assay description: Microsomes were prepared from COS-1 cells transiently transfected with a plasmid containing human mPGES-1 cDNA, and used as mPGES-1 enzyme. The mPGES...
Ligand InfoPC cidPC sid
In DepthDetails US Patent