BDBM454616 US10730865, Example 7
SMILES CCn1c(SCC(=O)Nc2nnc(s2)-c2ccc(cc2)S(C)(=O)=O)nnc1C1CC1
InChI Key InChIKey=ZBXJLFZZHGUAMQ-UHFFFAOYSA-N
Data  1 EC50
  Tab Delimited (TSV)   2D SDfile   Computed 3D by Vconf -m prep SDfile
Find this compound or compounds like it in BindingDB:
Activity Spreadsheet -- Enzyme Inhibition Constant Data from BindingDB
Found 1 hit for monomerid = 454616
TargetAquaporin-9(Human)
Apoglyx
US Patent
LigandPNGBDBM454616(US10730865, Example 7)
Affinity DataEC50:  105nM. Assay description: A calcein quenching fluostar assay was performed in order to investigate the biological activity of the newly synthesized examples 1 to 57. This type...
Ligand InfoPC cidPC sid
In DepthDetails US Patent