BDBM454634 US10730865, Example 25
SMILES CCOc1ccc(cc1)-c1nnc(NC(=O)CSc2nnc(CC)n2CC)s1
InChI Key InChIKey=PXVMDWKJRUOEIY-UHFFFAOYSA-N
Data  1 EC50
  Tab Delimited (TSV)   2D SDfile   Computed 3D by Vconf -m prep SDfile
Find this compound or compounds like it in BindingDB:
Activity Spreadsheet -- Enzyme Inhibition Constant Data from BindingDB
Found 1 hit for monomerid = 454634
TargetAquaporin-9(Human)
Apoglyx
US Patent
LigandPNGBDBM454634(US10730865, Example 25)
Affinity DataEC50:  42nM. Assay description: A calcein quenching fluostar assay was performed in order to investigate the biological activity of the newly synthesized examples 1 to 57. This type...
Ligand InfoPC cidPC sid
In DepthDetails US Patent