BDBM454653 US10730865, Example 44
SMILES CCn1c(CCOC)nnc1SCC(=O)Nc1nnc(s1)-c1ccc(OC)cc1
InChI Key InChIKey=URHXQABQRPVBEK-UHFFFAOYSA-N
Data  1 EC50
  Tab Delimited (TSV)   2D SDfile   Computed 3D by Vconf -m prep SDfile
Find this compound or compounds like it in BindingDB:
Activity Spreadsheet -- Enzyme Inhibition Constant Data from BindingDB
Found 1 hit for monomerid = 454653
TargetAquaporin-9(Human)
Apoglyx
US Patent
LigandPNGBDBM454653(US10730865, Example 44)
Affinity DataEC50:  457nM. Assay description: A calcein quenching fluostar assay was performed in order to investigate the biological activity of the newly synthesized examples 1 to 57. This type...
Ligand InfoPC cidPC sid
In DepthDetails US Patent