BDBM454658 US10730865, Example 49
SMILES CCc1nnc(SCC(=O)Nc2nnc(s2)-c2ccccn2)n1CC
InChI Key InChIKey=OODMANOWQGOPLA-UHFFFAOYSA-N
Data  1 EC50
  Tab Delimited (TSV)   2D SDfile   Computed 3D by Vconf -m prep SDfile
Find this compound or compounds like it in BindingDB:
Activity Spreadsheet -- Enzyme Inhibition Constant Data from BindingDB
Found 1 hit for monomerid = 454658
TargetAquaporin-9(Human)
Apoglyx
US Patent
LigandPNGBDBM454658(US10730865, Example 49)
Affinity DataEC50:  224nM. Assay description: A calcein quenching fluostar assay was performed in order to investigate the biological activity of the newly synthesized examples 1 to 57. This type...
Ligand InfoPC cidPC sid
In DepthDetails US Patent