BDBM454972 US10730870, Example 141::US11512083, Example 141
SMILES CC(C)C(C(=O)N1C[C@H](O)C[C@H]1C(=O)NCc1ccc(cc1)-c1scnc1C)c1cc(C)no1
InChI Key InChIKey=LIUCLKNTUXMZEI-MFCMXAAESA-N
Data  2 IC50
  Tab Delimited (TSV)   2D SDfile   Computed 3D by Vconf -m prep SDfile
Find this compound or compounds like it in BindingDB:
Activity Spreadsheet -- Enzyme Inhibition Constant Data from BindingDB
Found 2 hits for monomerid = 454972
TargetVHL complex(Homo sapiens (Human))
Arvinas Operations
US Patent
LigandPNGBDBM454972(US10730870, Example 141 | US11512083, Example 141)
Affinity DataIC50:  70.9nM. Assay description: Ability of VHL ligands to compete for the HIF 1 a binding site on VCB was determined through a fluorescence polarization competition assay as describ...
Ligand InfoKEGGPC cidPC sid
In DepthDetails US Patent
Targetvon Hippel-Lindau disease tumor suppressor(Homo sapiens (Human))
Arvinas Operations
US Patent
LigandPNGBDBM454972(US10730870, Example 141 | US11512083, Example 141)
Affinity DataIC50:  70.9nM. Assay description: Ability of VHL ligands to compete for the HIF 1 a binding site on VCB was determined through a fluorescence polarization competition assay as describ...
Ligand InfoKEGGPC cidPC sid
In DepthDetails US Patent