BDBM456156 (R)-6-(4-(((2-hydroxy-2- (4-methyl-1-oxo-1,3- dihydroisobenzofuran-5- yl)ethyl)amino)methyl)- 1H-1,2,3-triazol-1-yl)-2- methoxy-4- methylnicotinonitrile::US10723723, Example 67
SMILES COc1nc(cc(C)c1C#N)-n1cc(CNC[C@H](O)c2ccc3C(=O)OCc3c2C)nn1
InChI Key InChIKey=GZBWBYCRRRWTPB-IBGZPJMESA-N
Data  2 IC50
  Tab Delimited (TSV)   2D SDfile   Computed 3D by Vconf -m prep SDfile
Find this compound or compounds like it in BindingDB:
Activity Spreadsheet -- Enzyme Inhibition Constant Data from BindingDB
Found 2 hits for monomerid = 456156
TargetATP-sensitive inward rectifier potassium channel 1(Homo sapiens (Human))
Bristol-Myers Squibb
US Patent
LigandPNGBDBM456156((R)-6-(4-(((2-hydroxy-2- (4-methyl-1-oxo-1,3- dihy...)
Affinity DataIC50:  20nM. Assay description: Solutions and reagents: Thallium flux assay was performed using FluxOR kit (F10017, Life Technologies). Loading buffer, assay buffer and stimulus buf...
Ligand InfoPC cidPC sid
In DepthDetails US Patent
TargetATP-sensitive inward rectifier potassium channel 1(Homo sapiens (Human))
Bristol-Myers Squibb
US Patent
LigandPNGBDBM456156((R)-6-(4-(((2-hydroxy-2- (4-methyl-1-oxo-1,3- dihy...)
Affinity DataIC50:  9.30nM. Assay description: The coverslip plated with cells was placed in the experiment chamber perfused with bath solution composed of (in mM): 135 NaCl, 5 KCl, 2 CaCl2), 1 Mg...
Ligand InfoPC cidPC sid
In DepthDetails US Patent