BDBM456161 (R)-6-(4-(((2-hydroxy-2- (4-methyl-1-oxo-1,3- dihydroisobenzofuran-5- yl)ethyl)amino)methyl)- 1H-pyrazol-1-yl)-4- methoxy-2- methylnicotinonitrile::US10723723, Example 70
SMILES COc1cc(nc(C)c1C#N)-n1cc(CNC[C@H](O)c2ccc3C(=O)OCc3c2C)cn1
InChI Key InChIKey=GNODACXXCXRQBC-FQEVSTJZSA-N
Data  1 IC50
  Tab Delimited (TSV)   2D SDfile   Computed 3D by Vconf -m prep SDfile
Find this compound or compounds like it in BindingDB:
Activity Spreadsheet -- Enzyme Inhibition Constant Data from BindingDB
Found 1 hit for monomerid = 456161
TargetATP-sensitive inward rectifier potassium channel 1(Homo sapiens (Human))
Bristol-Myers Squibb
US Patent
LigandPNGBDBM456161((R)-6-(4-(((2-hydroxy-2- (4-methyl-1-oxo-1,3- dihy...)
Affinity DataIC50:  19nM. Assay description: Solutions and reagents: Thallium flux assay was performed using FluxOR kit (F10017, Life Technologies). Loading buffer, assay buffer and stimulus buf...
Ligand InfoPC cidPC sid
In DepthDetails US Patent