BDBM458357 US10752626, Compound 13
SMILES CCN1Cc2c(ccnc2N[C@@H](C)c2ccc(cc2)C(=O)Nc2ccccc2)C1=O
InChI Key InChIKey=WFLLHOBMFMCACG-INIZCTEOSA-N
Data  1 IC50
  Tab Delimited (TSV)   2D SDfile   Computed 3D by Vconf -m prep SDfile
Find this compound or compounds like it in BindingDB:
Activity Spreadsheet -- Enzyme Inhibition Constant Data from BindingDB
Found 1 hit for monomerid = 458357
TargetIsocitrate dehydrogenase [NADP] cytoplasmic [R132C](Homo sapiens (Human))
Shanghai Meton Pharmaceutical
US Patent
LigandPNGBDBM458357(US10752626, Compound 13)
Affinity DataIC50:  1.25E+4nM. Assay description: Solution A was prepared by combining 1 M Tris-HCl pH7.5 (300 μL), 5 M NaCl (450 μL), 1 M MgCl2 (150 μL), 1 M DTT (15 μL), 20 mg/m...
Ligand InfoPC cidPC sid
In DepthDetails US Patent