BDBM458363 US10752626, Compound 19
SMILES CCN1Cc2c(ccnc2N[C@@H](C)c2ccc(Oc3ccc(OC)cc3)cc2)C1=O
InChI Key InChIKey=BFVKXBUPIFCYEV-INIZCTEOSA-N
Data  1 IC50
  Tab Delimited (TSV)   2D SDfile   Computed 3D by Vconf -m prep SDfile
Find this compound or compounds like it in BindingDB:
Activity Spreadsheet -- Enzyme Inhibition Constant Data from BindingDB
Found 1 hit for monomerid = 458363
TargetIsocitrate dehydrogenase [NADP] cytoplasmic [R132C](Homo sapiens (Human))
Shanghai Meton Pharmaceutical
US Patent
LigandPNGBDBM458363(US10752626, Compound 19)
Affinity DataIC50: <1.50E+3nM. Assay description: Solution A was prepared by combining 1 M Tris-HCl pH7.5 (300 μL), 5 M NaCl (450 μL), 1 M MgCl2 (150 μL), 1 M DTT (15 μL), 20 mg/m...
Ligand InfoPC cidPC sid
In DepthDetails US Patent