BDBM46614 2-(4-fluorophenyl)-6-nitro-4-(2,2,2-trifluoroethoxy)-1,2-benzothiazol-3-one::2-(4-fluorophenyl)-6-nitro-4-[2,2,2-tris(fluoranyl)ethoxy]-1,2-benzothiazol-3-one::MLS-0315769.0001::cid_1510391
SMILES [O-][N+](=O)c1cc(OCC(F)(F)F)c2c(c1)sn(-c1ccc(F)cc1)c2=O
InChI Key InChIKey=NASVRHSQKZVPSG-UHFFFAOYSA-N
Data  3 IC50
  Tab Delimited (TSV)   2D SDfile   Computed 3D by Vconf -m prep SDfile
Find this compound or compounds like it in BindingDB:
Activity Spreadsheet -- Enzyme Inhibition Constant Data from BindingDB
Found 3 hits for monomerid = 46614
TargetPhosphomannomutase 2(Homo sapiens (Human))
Burnham Center For Chemical Genomics
Curated by PubChem BioAssay
LigandPNGBDBM46614(2-(4-fluorophenyl)-6-nitro-4-(2,2,2-trifluoroethox...)
Affinity DataIC50: >1.00E+5nM. Assay description: Data Source: Sanford-Burnham Center for Chemical Genomics (SBCCG) Source Affiliation: Sanford-Burnham Medical Research Institute (SBMRI, San Diego, C...
In DepthDetails PCBioAssay
TargetMannose-6-phosphate isomerase(Homo sapiens (Human))
Burnham Center For Chemical Genomics
Curated by PubChem BioAssay
LigandPNGBDBM46614(2-(4-fluorophenyl)-6-nitro-4-(2,2,2-trifluoroethox...)
Affinity DataIC50:  2.61E+4nM. Assay description: Data Source: Sanford-Burnham Center for Chemical Genomics (SBCCG) Source Affiliation: Sanford-Burnham Medical Research Institute (SBMRI, San Diego, C...
In DepthDetails PCBioAssay
TargetPhosphoethanolamine/phosphocholine phosphatase(Homo sapiens (Human))
Burnham Center For Chemical Genomics
Curated by PubChem BioAssay
LigandPNGBDBM46614(2-(4-fluorophenyl)-6-nitro-4-(2,2,2-trifluoroethox...)
Affinity DataIC50:  577nM. Assay description: Data Source: Sanford-Burnham Center for Chemical Genomics (SBCCG) Source Affiliation: Sanford-Burnham Medical Research Institute (SBMRI, San Diego, C...
In DepthDetails PCBioAssay