BDBM46621 6-fluoranyl-2-[2,4,5-tris(chloranyl)phenyl]-1,2-benzothiazol-3-one::6-fluoro-2-(2,4,5-trichlorophenyl)-1,2-benzothiazol-3-one::MLS-0315773.0001::cid_5295225
SMILES Fc1ccc2c(c1)sn(-c1cc(Cl)c(Cl)cc1Cl)c2=O
InChI Key InChIKey=MDVAZDJPBSDPBS-UHFFFAOYSA-N
Data  3 IC50
  Tab Delimited (TSV)   2D SDfile   Computed 3D by Vconf -m prep SDfile
Find this compound or compounds like it in BindingDB:
Activity Spreadsheet -- Enzyme Inhibition Constant Data from BindingDB
Found 3 hits for monomerid = 46621
TargetPhosphomannomutase 2(Homo sapiens (Human))
Burnham Center For Chemical Genomics
Curated by PubChem BioAssay
LigandPNGBDBM46621(6-fluoranyl-2-[2,4,5-tris(chloranyl)phenyl]-1,2-be...)
Affinity DataIC50: >1.00E+5nM. Assay description: Data Source: Sanford-Burnham Center for Chemical Genomics (SBCCG) Source Affiliation: Sanford-Burnham Medical Research Institute (SBMRI, San Diego, C...
In DepthDetails PCBioAssay
TargetMannose-6-phosphate isomerase(Homo sapiens (Human))
Burnham Center For Chemical Genomics
Curated by PubChem BioAssay
LigandPNGBDBM46621(6-fluoranyl-2-[2,4,5-tris(chloranyl)phenyl]-1,2-be...)
Affinity DataIC50: >5.00E+4nM. Assay description: Data Source: Sanford-Burnham Center for Chemical Genomics (SBCCG) Source Affiliation: Sanford-Burnham Medical Research Institute (SBMRI, San Diego, C...
In DepthDetails PCBioAssay
TargetPhosphoethanolamine/phosphocholine phosphatase(Homo sapiens (Human))
Burnham Center For Chemical Genomics
Curated by PubChem BioAssay
LigandPNGBDBM46621(6-fluoranyl-2-[2,4,5-tris(chloranyl)phenyl]-1,2-be...)
Affinity DataIC50:  564nM. Assay description: Data Source: Sanford-Burnham Center for Chemical Genomics (SBCCG) Source Affiliation: Sanford-Burnham Medical Research Institute (SBMRI, San Diego, C...
In DepthDetails PCBioAssay