BDBM46645 2-(4-morpholin-4-ylsulfonylphenyl)-1,2-benzothiazol-3-one::2-(4-morpholinosulfonylphenyl)-1,2-benzothiazol-3-one::2-[4-(4-morpholinylsulfonyl)phenyl]-1,2-benzothiazol-3-one::MLS-0315795.0001::cid_2325814
SMILES O=c1n(sc2ccccc12)-c1ccc(cc1)S(=O)(=O)N1CCOCC1
InChI Key InChIKey=HRHZCBHIGBSZLL-UHFFFAOYSA-N
Data  3 IC50
  Tab Delimited (TSV)   2D SDfile   Computed 3D by Vconf -m prep SDfile
Find this compound or compounds like it in BindingDB:
Activity Spreadsheet -- Enzyme Inhibition Constant Data from BindingDB
Found 3 hits for monomerid = 46645
TargetPhosphomannomutase 2(Homo sapiens (Human))
Burnham Center For Chemical Genomics
Curated by PubChem BioAssay
LigandPNGBDBM46645(2-(4-morpholin-4-ylsulfonylphenyl)-1,2-benzothiazo...)
Affinity DataIC50: >1.00E+5nM. Assay description: Data Source: Sanford-Burnham Center for Chemical Genomics (SBCCG) Source Affiliation: Sanford-Burnham Medical Research Institute (SBMRI, San Diego, C...
In DepthDetails PCBioAssay
TargetMannose-6-phosphate isomerase(Homo sapiens (Human))
Burnham Center For Chemical Genomics
Curated by PubChem BioAssay
LigandPNGBDBM46645(2-(4-morpholin-4-ylsulfonylphenyl)-1,2-benzothiazo...)
Affinity DataIC50: >5.00E+4nM. Assay description: Data Source: Sanford-Burnham Center for Chemical Genomics (SBCCG) Source Affiliation: Sanford-Burnham Medical Research Institute (SBMRI, San Diego, C...
In DepthDetails PCBioAssay
TargetPhosphoethanolamine/phosphocholine phosphatase(Homo sapiens (Human))
Burnham Center For Chemical Genomics
Curated by PubChem BioAssay
LigandPNGBDBM46645(2-(4-morpholin-4-ylsulfonylphenyl)-1,2-benzothiazo...)
Affinity DataIC50:  545nM. Assay description: Data Source: Sanford-Burnham Center for Chemical Genomics (SBCCG) Source Affiliation: Sanford-Burnham Medical Research Institute (SBMRI, San Diego, C...
In DepthDetails PCBioAssay