BDBM469351 US10807988, Example SC_3002::cis-5-[1-(Cyclobutyl-methyl)-8-dimethylamino-2-oxo-8-phenyl-1,3- diazaspiro[4.5]decan-3-yl]-pyrazine-2-carbonitrile
SMILES CN(C)[C@]1(CC[C@]2(CN(C(=O)N2CC2CCC2)c2cnc(cn2)C#N)CC1)c1ccccc1
InChI Key InChIKey=CXYSFAHQJFIKCV-WMPKNSHKSA-N
Data  2 KI
  Tab Delimited (TSV)   2D SDfile   Computed 3D by Vconf -m prep SDfile
Find this compound or compounds like it in BindingDB:
Activity Spreadsheet -- Enzyme Inhibition Constant Data from BindingDB
Found 2 hits for monomerid = 469351
TargetNociceptin receptor(Homo sapiens (Human))
GrüNenthal
US Patent
LigandPNGBDBM469351(US10807988, Example SC_3002 | cis-5-[1-(Cyclobutyl...)
Affinity DataKi:  1.30nM. Assay description: The hNOP receptor binding assay was performed as homogeneous SPA-assay (scintillation proximity assay) using the assay buffer 50 mM TRIS-HCl. 10 mM M...
Ligand InfoPC cidPC sid
In DepthDetails US Patent
TargetMu-type opioid receptor(Homo sapiens (Human))
GrüNenthal
US Patent
LigandPNGBDBM469351(US10807988, Example SC_3002 | cis-5-[1-(Cyclobutyl...)
Affinity DataKi:  250nM. Assay description: The hMOP receptor binding assay was performed as homogeneous SPA-assay (scintillation proximity assay) using the assay buffer 50 mM TRIS-HCl (pH 7.4)...
Ligand InfoPC cidPC sid
In DepthDetails US Patent