BDBM469461 US10807988, Example SC_3103::cis-1-(Cyclobutyl-methyl)-8-dimethylamino-3-[4-methyl-6-(trifluoromethyl)- pyridin-3-yl]-8-phenyl-1,3-diazaspiro[4.5]decan-2-one
SMILES CN(C)[C@]1(CC[C@]2(CN(C(=O)N2CC2CCC2)c2cnc(cc2C)C(F)(F)F)CC1)c1ccccc1
InChI Key InChIKey=BADXUWHGJCUUAO-MKPDMIMOSA-N
Data  2 KI
  Tab Delimited (TSV)   2D SDfile   Computed 3D by Vconf -m prep SDfile
Find this compound or compounds like it in BindingDB:
Activity Spreadsheet -- Enzyme Inhibition Constant Data from BindingDB
Found 2 hits for monomerid = 469461
TargetMu-type opioid receptor(Homo sapiens (Human))
GrüNenthal
US Patent
LigandPNGBDBM469461(US10807988, Example SC_3103 | cis-1-(Cyclobutyl-me...)
Affinity DataKi:  1nM. Assay description: The hMOP receptor binding assay was performed as homogeneous SPA-assay (scintillation proximity assay) using the assay buffer 50 mM TRIS-HCl (pH 7.4)...
Ligand InfoPC cidPC sid
In DepthDetails US Patent
TargetNociceptin receptor(Homo sapiens (Human))
GrüNenthal
US Patent
LigandPNGBDBM469461(US10807988, Example SC_3103 | cis-1-(Cyclobutyl-me...)
Affinity DataKi:  7nM. Assay description: The hNOP receptor binding assay was performed as homogeneous SPA-assay (scintillation proximity assay) using the assay buffer 50 mM TRIS-HCl. 10 mM M...
Ligand InfoPC cidPC sid
In DepthDetails US Patent