BDBM469469 US10807988, Example SC_3107::cis-1-(Cyclopropyl-methyl)-8-dimethylamino-3-(2-fluoro-4-methylsulfonyl- phenyl)-8-phenyl-1,3-diazaspiro[4.5]decan-2-one
SMILES CN(C)[C@]1(CC[C@]2(CN(C(=O)N2CC2CC2)c2ccc(cc2F)S(C)(=O)=O)CC1)c1ccccc1
InChI Key InChIKey=QEKCFPSPDQUCPQ-MKPDMIMOSA-N
Data  2 KI
  Tab Delimited (TSV)   2D SDfile   Computed 3D by Vconf -m prep SDfile
Find this compound or compounds like it in BindingDB:
Activity Spreadsheet -- Enzyme Inhibition Constant Data from BindingDB
Found 2 hits for monomerid = 469469
TargetNociceptin receptor(Homo sapiens (Human))
GrüNenthal
US Patent
LigandPNGBDBM469469(US10807988, Example SC_3107 | cis-1-(Cyclopropyl-m...)
Affinity DataKi:  2nM. Assay description: The hNOP receptor binding assay was performed as homogeneous SPA-assay (scintillation proximity assay) using the assay buffer 50 mM TRIS-HCl. 10 mM M...
Ligand InfoPC cidPC sid
In DepthDetails US Patent
TargetMu-type opioid receptor(Homo sapiens (Human))
GrüNenthal
US Patent
LigandPNGBDBM469469(US10807988, Example SC_3107 | cis-1-(Cyclopropyl-m...)
Affinity DataKi:  115nM. Assay description: The hMOP receptor binding assay was performed as homogeneous SPA-assay (scintillation proximity assay) using the assay buffer 50 mM TRIS-HCl (pH 7.4)...
Ligand InfoPC cidPC sid
In DepthDetails US Patent