BDBM469708 US10807988, Example SC_3344::cis-8-Dimethylamino-3-[2-(1-oxo-2,3-dihydro-isoindol-4-yl)-pyrimidin-5-yl]-8- phenyl-1,3-diazaspiro[4.5]decan-2-one; 2,2,2-trifluoro-acetic acid
SMILES CN(C)[C@]1(CC[C@]2(CN(C(=O)N2)c2cnc(nc2)-c2cccc3C(=O)NCc23)CC1)c1ccccc1
InChI Key InChIKey=FWANFVCJUDYSTL-HNRBIFIRSA-N
Data  1 KI
  Tab Delimited (TSV)   2D SDfile   Computed 3D by Vconf -m prep SDfile
Find this compound or compounds like it in BindingDB:
Activity Spreadsheet -- Enzyme Inhibition Constant Data from BindingDB
Found 1 hit for monomerid = 469708
TargetNociceptin receptor(Homo sapiens (Human))
GrüNenthal
US Patent
LigandPNGBDBM469708(US10807988, Example SC_3344 | cis-8-Dimethylamino-...)
Affinity DataKi:  1nM. Assay description: The hNOP receptor binding assay was performed as homogeneous SPA-assay (scintillation proximity assay) using the assay buffer 50 mM TRIS-HCl. 10 mM M...
Ligand InfoPC cidPC sid
In DepthDetails US Patent