BDBM472168 (S)-1-((2,2-difluorobenzo[d][1,3]dioxol-4-yl)methyl)-N-(1-(4-::US10829481, Compound I-11.2
SMILES CCS(=O)(=O)c1ccc(cc1)[C@@H](CO)NC(=O)c1ccc2n(Cc3cccc4OC(F)(F)Oc34)c(nc2c1)C(F)(F)F
InChI Key InChIKey=QOQQXGOQPMUGSD-HXUWFJFHSA-N
Data  1 KI
  Tab Delimited (TSV)   2D SDfile   Computed 3D by Vconf -m prep SDfile
Find this compound or compounds like it in BindingDB:
Activity Spreadsheet -- Enzyme Inhibition Constant Data from BindingDB
Found 1 hit for monomerid = 472168
TargetNuclear receptor ROR-gamma(Homo sapiens (Human))
Vitae Pharmaceuticals
US Patent
LigandPNGBDBM472168((S)-1-((2,2-difluorobenzo[d][1,3]dioxol-4-yl)methy...)
Affinity DataKi: <100nM. Assay description: Compounds described herein were tested for ability to bind to RORγ in a cell-free competition assay with commercially available radio-ligand (RL...
Ligand InfoPC cidPC sid
In DepthDetails US Patent