BDBM474334 2-(2,6-difluorobenzyl)-8-(3-methylimidazo[l,2-a] pyridin-6-yl)-7-morpholino-[1,2,4] triazolo[1,5-c] pyrimidin-5-amine::US10858365, Compound 121
SMILES Cc1cnc2ccc(cn12)-c1c(nc(N)n2nc(Cc3c(F)cccc3F)nc12)N1CCOCC1
InChI Key InChIKey=QOCNPKMKLAIZQX-UHFFFAOYSA-N
Data  4 IC50
  Tab Delimited (TSV)   2D SDfile   Computed 3D by Vconf -m prep SDfile
Find this compound or compounds like it in BindingDB:
Activity Spreadsheet -- Enzyme Inhibition Constant Data from BindingDB
Found 4 hits for monomerid = 474334
TargetAdenosine receptor A2a(Homo sapiens (Human))
TBA
US Patent
LigandPNGBDBM474334(2-(2,6-difluorobenzyl)-8-(3-methylimidazo[l,2-a] p...)
Affinity DataIC50:  0.200nM. Assay description: The compounds at different concentrations were incubate with hA1 membrane (from PerkinElmer) and [3H]-8-Cyclopentyl-1,3-dipropylxanthine (DPCPX) for ...
Ligand InfoPC cidPC sid
In DepthDetails US Patent
TargetAdenosine receptor A1(Homo sapiens (Human))
TBA
US Patent
LigandPNGBDBM474334(2-(2,6-difluorobenzyl)-8-(3-methylimidazo[l,2-a] p...)
Affinity DataIC50:  71.5nM. Assay description: hADORA1/CHO (hA1 expressing) cells (Genscript) were plated at 1×104 cells/well into 384-well polystyrene plates one day before starting the experimen...
Ligand InfoPC cidPC sid
In DepthDetails US Patent
TargetAdenosine receptor A2a(Mus musculus)
TBA
US Patent
LigandPNGBDBM474334(2-(2,6-difluorobenzyl)-8-(3-methylimidazo[l,2-a] p...)
Affinity DataIC50:  2.90nM. Assay description: hADORA1/CHO (hA1 expressing) cells (Genscript) were plated at 1×104 cells/well into 384-well polystyrene plates one day before starting the experimen...
Ligand InfoPC cidPC sid
In DepthDetails US Patent
TargetAdenosine receptor A2b(Homo sapiens (Human))
TBA
US Patent
LigandPNGBDBM474334(2-(2,6-difluorobenzyl)-8-(3-methylimidazo[l,2-a] p...)
Affinity DataIC50:  44.5nM. Assay description: hADORA1/CHO (hA1 expressing) cells (Genscript) were plated at 1×104 cells/well into 384-well polystyrene plates one day before starting the experimen...
Ligand InfoPC cidPC sid
In DepthDetails US Patent