BDBM474988 US10849982, Compd # 1
SMILES O=C1NC(=O)C2(CC12)c1ccccc1
InChI Key InChIKey=GBKKVNBNBVUCIV-UHFFFAOYSA-N
Data  1 Kd
  Tab Delimited (TSV)   2D SDfile   Computed 3D by Vconf -m prep SDfile
Find this compound or compounds like it in BindingDB:
Activity Spreadsheet -- Enzyme Inhibition Constant Data from BindingDB
Found 1 hit for monomerid = 474988
TargetDNA damage-binding protein 1/Protein cereblon(Homo sapiens (Human))
C4 Therapeutics
US Patent
LigandPNGBDBM474988(US10849982, Compd # 1)
Affinity DataKd: >1.00E+5nM. Assay description: Measuring compound ligand binding to CRBN-DDB1 was carried out using an established sensitive and quantitative in vitro fluorescence polarization (FP...
In DepthDetails US Patent