BDBM475076 US10849982, Compd # 3
SMILES [O-][N+](=O)c1ccc(cc1)C12CC1C(=O)NC2=O
InChI Key InChIKey=CZGLQVJHGXNWHV-UHFFFAOYSA-N
Data  1 Kd
  Tab Delimited (TSV)   2D SDfile   Computed 3D by Vconf -m prep SDfile
Find this compound or compounds like it in BindingDB:
Activity Spreadsheet -- Enzyme Inhibition Constant Data from BindingDB
Found 1 hit for monomerid = 475076
TargetDNA damage-binding protein 1/Protein cereblon(Homo sapiens (Human))
C4 Therapeutics
US Patent
LigandPNGBDBM475076(US10849982, Compd # 3)
Affinity DataKd: >1.00E+5nM. Assay description: Measuring compound ligand binding to CRBN-DDB1 was carried out using an established sensitive and quantitative in vitro fluorescence polarization (FP...
Ligand InfoPC cidPC sid
In DepthDetails US Patent