BDBM475114 US10849982, Compd # 25
SMILES Cn1cc(CC2CCC(=O)NC2=O)nn1
InChI Key InChIKey=XMZVPQNDUDRSGN-UHFFFAOYSA-N
Data  1 Kd
  Tab Delimited (TSV)   2D SDfile   Computed 3D by Vconf -m prep SDfile
Find this compound or compounds like it in BindingDB:
Activity Spreadsheet -- Enzyme Inhibition Constant Data from BindingDB
Found 1 hit for monomerid = 475114
TargetDNA damage-binding protein 1/Protein cereblon(Homo sapiens (Human))
C4 Therapeutics
US Patent
LigandPNGBDBM475114(US10849982, Compd # 25)
Affinity DataKd:  7.50E+4nM. Assay description: Measuring compound ligand binding to CRBN-DDB1 was carried out using an established sensitive and quantitative in vitro fluorescence polarization (FP...
Ligand InfoPC cidPC sid
In DepthDetails US Patent