BDBM475117 US10849982, Compd # 28
SMILES O=C1CCC(c2ncc3ccccn23)C(=O)N1
InChI Key InChIKey=RDVSIINCTSJRIT-UHFFFAOYSA-N
Data  1 Kd
  Tab Delimited (TSV)   2D SDfile   Computed 3D by Vconf -m prep SDfile
Find this compound or compounds like it in BindingDB:
Activity Spreadsheet -- Enzyme Inhibition Constant Data from BindingDB
Found 1 hit for monomerid = 475117
TargetDNA damage-binding protein 1/Protein cereblon(Homo sapiens (Human))
C4 Therapeutics
US Patent
LigandPNGBDBM475117(US10849982, Compd # 28)
Affinity DataKd: <1.00E+4nM. Assay description: Measuring compound ligand binding to CRBN-DDB1 was carried out using an established sensitive and quantitative in vitro fluorescence polarization (FP...
Ligand InfoPC cidPC sid
In DepthDetails US Patent