BDBM475622 US10851091, U.S. Pat. No. 8,242,104 No. 549 isomer 2
SMILES CC(C)n1ncnc1-c1cn2CCOc3cc(O[C@@H](C4CC4)C(N)=O)ccc3-c2n1
InChI Key InChIKey=GFOJWGYPLGSKOJ-SFHVURJKSA-N
Data  2 KI
  Tab Delimited (TSV)   2D SDfile   Computed 3D by Vconf -m prep SDfile
Find this compound or compounds like it in BindingDB:
Activity Spreadsheet -- Enzyme Inhibition Constant Data from BindingDB
Found 2 hits for monomerid = 475622
LigandPNGBDBM475622(US10851091, U.S. Pat. No. 8,242,104 No. 549 isomer...)
Affinity DataKi:  1.70nM. Assay description: The biochemical inhibition of four PI3K isoforms by the Formula I compounds of Table 1. In addition, two clinically tested PI3K compounds, taselisib ...
Ligand InfoPC cidPC sid
In DepthDetails US Patent
LigandPNGBDBM475622(US10851091, U.S. Pat. No. 8,242,104 No. 549 isomer...)
Affinity DataKi:  5.66nM. Assay description: The biochemical inhibition of four PI3K isoforms by the Formula I compounds of Table 1. In addition, two clinically tested PI3K compounds, taselisib ...
Ligand InfoPC cidPC sid
In DepthDetails US Patent