BDBM478261 US10894782, No 114
SMILES OCC#Cc1cc(F)c(OCc2nnc(SC3CCCC=C3)n2-c2cccnc2)cc1F
InChI Key InChIKey=FFDUPPVUOFGKHI-UHFFFAOYSA-N
Data  1 IC50
  Tab Delimited (TSV)   2D SDfile   Computed 3D by Vconf -m prep SDfile
Find this compound or compounds like it in BindingDB:
Activity Spreadsheet -- Enzyme Inhibition Constant Data from BindingDB
Found 1 hit for monomerid = 478261
TargetTransitional endoplasmic reticulum ATPase(Homo sapiens (Human))
University of Pittsburgh
US Patent
LigandPNGBDBM478261(US10894782, No 114)
Affinity DataIC50:  20nM. Assay description: Biomol Green (Enzo) is a bioluminescent, homogeneous assay that measures ADP formed from a biochemical reaction. Because of its high sensitivity, the...
Ligand InfoPC cidPC sid
In DepthDetails US Patent