BDBM479297 US10894789, Compound 242
SMILES C[C@@H]1CC(F)(F)CN([C@@H]1CNc1ncc(cc1F)C(F)(F)F)C(=O)c1nn(C)cc1-c1ncc(F)cn1
InChI Key InChIKey=CIFNAVJKLUBXLW-BDJLRTHQSA-N
Data  2 IC50
  Tab Delimited (TSV)   2D SDfile   Computed 3D by Vconf -m prep SDfile
Find this compound or compounds like it in BindingDB:
Activity Spreadsheet -- Enzyme Inhibition Constant Data from BindingDB
Found 2 hits for monomerid = 479297
TargetOrexin/Hypocretin receptor type 1(Homo sapiens (Human))
Astrazeneca
US Patent
LigandPNGBDBM479297(US10894789, Compound 242)
Affinity DataIC50:  5nM. Assay description: Measurement of [Ca2+]i using a FLIPR: CHO—OX1 or CHO—OX2 cells were seeded into black-walled clear-base 384-well plates (Corning, catalog #3712) at a...
Ligand InfoPC cidPC sid
In DepthDetails US Patent
TargetOrexin receptor type 2(Homo sapiens (Human))
Astrazeneca
US Patent
LigandPNGBDBM479297(US10894789, Compound 242)
Affinity DataIC50: >5.00E+3nM. Assay description: Measurement of [Ca2+]i using a FLIPR: CHO—OX1 or CHO—OX2 cells were seeded into black-walled clear-base 384-well plates (Corning, catalog #3712) at a...
Ligand InfoPC cidPC sid
In DepthDetails US Patent