BDBM484047 (S)-1-(3-(1- (hydroxymethyl) cyclopropylsulfonyl) phenoxy)- 3-((R)-8-(quinolin-3- ylsulfonyl)-1-oxa-8- azaspiro[4.5]decan-3- ylamino)propan-2-ol::US10927123, Compound 136
SMILES OCC1(CC1)S(=O)(=O)c1cccc(OC[C@@H](O)CN[C@H]2COC3(C2)CCN(CC3)S(=O)(=O)c2cnc3ccccc3c2)c1
InChI Key InChIKey=ZUYFAHYJNMCDJP-RPWUZVMVSA-N
Data  1 IC50
  Tab Delimited (TSV)   2D SDfile   Computed 3D by Vconf -m prep SDfile
Find this compound or compounds like it in BindingDB:
Activity Spreadsheet -- Enzyme Inhibition Constant Data from BindingDB
Found 1 hit for monomerid = 484047
TargetBeta-3 adrenergic receptor(Homo sapiens (Human))
Arena Pharmaceuticals
US Patent
LigandPNGBDBM484047((S)-1-(3-(1- (hydroxymethyl) cyclopropylsulfonyl) ...)
Affinity DataIC50:  1.88E+4nM. Assay description: Compounds were dissolved and serially diluted (5-fold) in DMSO to generate a 10-point dose response stock. The stock was then diluted 100-fold in ass...
Ligand InfoPC cidPC sid
In DepthDetails US Patent