BDBM484060 (S)-1-((S)-8-(4'- (aminomethyl)-4- ethoxybiphenyl-3- ylsulfonyl)-1-oxa-8- azaspiro[4.5]decan-3- ylamino)-3-(3- (isopropylsulfonyl) phenoxy)propan-2-ol::US10927123, Compound 232
SMILES CCOc1ccc(cc1S(=O)(=O)N1CCC2(C[C@@H](CO2)NC[C@H](O)COc2cccc(c2)S(=O)(=O)C(C)C)CC1)-c1ccc(CN)cc1
InChI Key InChIKey=YRGFWSXWUWTZSV-KYJUHHDHSA-N
Data  1 IC50
  Tab Delimited (TSV)   2D SDfile   Computed 3D by Vconf -m prep SDfile
Find this compound or compounds like it in BindingDB:
Activity Spreadsheet -- Enzyme Inhibition Constant Data from BindingDB
Found 1 hit for monomerid = 484060
TargetBeta-3 adrenergic receptor(Homo sapiens (Human))
Arena Pharmaceuticals
US Patent
LigandPNGBDBM484060((S)-1-((S)-8-(4'- (aminomethyl)-4- ethoxybiphenyl-...)
Affinity DataIC50:  1.66E+4nM. Assay description: Compounds were dissolved and serially diluted (5-fold) in DMSO to generate a 10-point dose response stock. The stock was then diluted 100-fold in ass...
Ligand InfoPC cidPC sid
In DepthDetails US Patent