BDBM485339 N-((1R,2S)-2-Acrylamidocyclohexyl)-5-(*S)-(4-methyl-6- phenoxypyridin-3-yl)-4-oxo-4,5-dihydro-3H-1-thia-3,5,8- triazaacenaphthylene-2-carboxamide::US10934310, Ex # 173::US11319329, Ex # 173
SMILES Cc1cc(Oc2ccccc2)ncc1-n1c2ccnc3sc(C(=O)N[C@@H]4CCCC[C@@H]4NC(=O)C=C)c([nH]c1=O)c23
InChI Key
Data  2 IC50
  Tab Delimited (TSV)   2D SDfile   Computed 3D by Vconf -m prep SDfile
Find this compound or compounds like it in BindingDB:
Activity Spreadsheet -- Enzyme Inhibition Constant Data from BindingDB
Found 2 hits for monomerid = 485339
TargetTyrosine-protein kinase BTK(Homo sapiens (Human))
Janssen Pharmaceutica
US Patent
LigandPNGBDBM485339(N-((1R,2S)-2-Acrylamidocyclohexyl)-5-(*S)-(4-methy...)
Affinity DataIC50:  9.55nM. Assay description: A BTK kinase lanthascreen binding assay monitors compound binding to unphosphorylated-BTK kinase domain (UP-BTK), by competing with a fluorescent lab...
Ligand InfoPC cidPC sid
In DepthDetails US Patent
TargetTyrosine-protein kinase BTK(Homo sapiens (Human))
Janssen Pharmaceutica
US Patent
LigandPNGBDBM485339(N-((1R,2S)-2-Acrylamidocyclohexyl)-5-(*S)-(4-methy...)
Affinity DataIC50:  9.55nM. Assay description: A BTK kinase lanthascreen binding assay monitors compound binding to unphosphorylated-BTK kinase domain (UP-BTK), by competing with a fluorescent lab...
Ligand InfoPC cidPC sid
In DepthDetails US Patent