BDBM485345 N-((1R,2S)-2-Acrylamidocyclopentyl)-4-oxo-5-(5-phenoxypyridin- 2-yl)-4,5-dihydro-3H-1-thia-3,5,8-triazaacenaphthylene-2- carboxamide::US10934310, Ex # 179::US11319329, Ex # 179
SMILES C=CC(=O)N[C@H]1CCC[C@H]1NC(=O)c1sc2nccc3n(-c4ccc(Oc5ccccc5)cn4)c(=O)[nH]c1c23
InChI Key
Data  2 IC50
  Tab Delimited (TSV)   2D SDfile   Computed 3D by Vconf -m prep SDfile
Find this compound or compounds like it in BindingDB:
Activity Spreadsheet -- Enzyme Inhibition Constant Data from BindingDB
Found 2 hits for monomerid = 485345
TargetTyrosine-protein kinase BTK(Homo sapiens (Human))
Janssen Pharmaceutica
US Patent
LigandPNGBDBM485345(N-((1R,2S)-2-Acrylamidocyclopentyl)-4-oxo-5-(5-phe...)
Affinity DataIC50:  4.27nM. Assay description: A BTK kinase lanthascreen binding assay monitors compound binding to unphosphorylated-BTK kinase domain (UP-BTK), by competing with a fluorescent lab...
Ligand InfoPC cidPC sid
In DepthDetails US Patent
TargetTyrosine-protein kinase BTK(Homo sapiens (Human))
Janssen Pharmaceutica
US Patent
LigandPNGBDBM485345(N-((1R,2S)-2-Acrylamidocyclopentyl)-4-oxo-5-(5-phe...)
Affinity DataIC50:  4.27nM. Assay description: A BTK kinase lanthascreen binding assay monitors compound binding to unphosphorylated-BTK kinase domain (UP-BTK), by competing with a fluorescent lab...
Ligand InfoPC cidPC sid
In DepthDetails US Patent