BDBM485386 N-((1R,2S)-2-Acrylamidocyclopentyl)-5-(2-methyl-4-(pyridin-2- yloxy)phenyl)-4-oxo-4,5-dihydro-3H-1-thia-3,5,8- triazaacenaphthylene-2-carboxamide::US10934310, Ex # 220::US11319329, Ex # 220
SMILES Cc1cc(Oc2ccccn2)ccc1-n1c2ccnc3sc(C(=O)N[C@@H]4CCC[C@@H]4NC(=O)C=C)c([nH]c1=O)c23
InChI Key
Data  2 IC50
  Tab Delimited (TSV)   2D SDfile   Computed 3D by Vconf -m prep SDfile
Find this compound or compounds like it in BindingDB:
Activity Spreadsheet -- Enzyme Inhibition Constant Data from BindingDB
Found 2 hits for monomerid = 485386
TargetTyrosine-protein kinase BTK(Homo sapiens (Human))
Janssen Pharmaceutica
US Patent
LigandPNGBDBM485386(N-((1R,2S)-2-Acrylamidocyclopentyl)-5-(2-methyl-4-...)
Affinity DataIC50:  6.92nM. Assay description: A BTK kinase lanthascreen binding assay monitors compound binding to unphosphorylated-BTK kinase domain (UP-BTK), by competing with a fluorescent lab...
Ligand InfoPC cidPC sid
In DepthDetails US Patent
TargetTyrosine-protein kinase BTK(Homo sapiens (Human))
Janssen Pharmaceutica
US Patent
LigandPNGBDBM485386(N-((1R,2S)-2-Acrylamidocyclopentyl)-5-(2-methyl-4-...)
Affinity DataIC50:  6.92nM. Assay description: A BTK kinase lanthascreen binding assay monitors compound binding to unphosphorylated-BTK kinase domain (UP-BTK), by competing with a fluorescent lab...
Ligand InfoPC cidPC sid
In DepthDetails US Patent