BDBM485458 N-((1RS,2RS)-2-Acrylamidocyclopentyl)-5-(2-methyl-6- phenoxypyridin-3-yl)-4-oxo-4,5-dihydro-3H-1-thia-3,5,8- triazaacenaphthylene-2-carboxamide::US10934310, Ex # 292::US11319329, Ex # 292
SMILES C=CC(=O)N[C@@H]1CCC(C1)NC(=O)c1sc2nccc3n(-c4ccc(Oc5ccccc5)nc4)c(=O)[nH]c1c23
InChI Key
Data  2 IC50
  Tab Delimited (TSV)   2D SDfile   Computed 3D by Vconf -m prep SDfile
Find this compound or compounds like it in BindingDB:
Activity Spreadsheet -- Enzyme Inhibition Constant Data from BindingDB
Found 2 hits for monomerid = 485458
TargetTyrosine-protein kinase BTK(Homo sapiens (Human))
Janssen Pharmaceutica
US Patent
LigandPNGBDBM485458(N-((1RS,2RS)-2-Acrylamidocyclopentyl)-5-(2-methyl-...)
Affinity DataIC50:  4.17nM. Assay description: A BTK kinase lanthascreen binding assay monitors compound binding to unphosphorylated-BTK kinase domain (UP-BTK), by competing with a fluorescent lab...
Ligand InfoPC cidPC sid
In DepthDetails US Patent
TargetTyrosine-protein kinase BTK(Homo sapiens (Human))
Janssen Pharmaceutica
US Patent
LigandPNGBDBM485458(N-((1RS,2RS)-2-Acrylamidocyclopentyl)-5-(2-methyl-...)
Affinity DataIC50:  4.17nM. Assay description: A BTK kinase lanthascreen binding assay monitors compound binding to unphosphorylated-BTK kinase domain (UP-BTK), by competing with a fluorescent lab...
Ligand InfoPC cidPC sid
In DepthDetails US Patent