BDBM485466 N-((1R,2S)-2-Acrylamidocyclohexyl)-4-oxo-5-(2- phenoxypyrimidin-5-yl)-4,5-dihydro-3H-1-thia-3,5,8- triazaacenaphthylene-2-carboxamide::US10934310, Ex # 302::US11319329, Ex # 302
SMILES C=CC(=O)N[C@H]1CCCC[C@H]1NC(=O)c1sc2nccc3n(-c4cnc(Oc5ccccc5)nc4)c(=O)[nH]c1c23
InChI Key
Data  2 IC50
  Tab Delimited (TSV)   2D SDfile   Computed 3D by Vconf -m prep SDfile
Find this compound or compounds like it in BindingDB:
Activity Spreadsheet -- Enzyme Inhibition Constant Data from BindingDB
Found 2 hits for monomerid = 485466
TargetTyrosine-protein kinase BTK(Homo sapiens (Human))
Janssen Pharmaceutica
US Patent
LigandPNGBDBM485466(N-((1R,2S)-2-Acrylamidocyclohexyl)-4-oxo-5-(2- phe...)
Affinity DataIC50:  5.89nM. Assay description: A BTK kinase lanthascreen binding assay monitors compound binding to unphosphorylated-BTK kinase domain (UP-BTK), by competing with a fluorescent lab...
Ligand InfoPC cidPC sid
In DepthDetails US Patent
TargetTyrosine-protein kinase BTK(Homo sapiens (Human))
Janssen Pharmaceutica
US Patent
LigandPNGBDBM485466(N-((1R,2S)-2-Acrylamidocyclohexyl)-4-oxo-5-(2- phe...)
Affinity DataIC50:  5.89nM. Assay description: A BTK kinase lanthascreen binding assay monitors compound binding to unphosphorylated-BTK kinase domain (UP-BTK), by competing with a fluorescent lab...
Ligand InfoPC cidPC sid
In DepthDetails US Patent