BDBM486659 US10947252, Example 94::US11427601, Example 94
SMILES Cc1c(ccn2c(nnc12)C(F)(F)F)[C@@H](CC(O)=O)c1ccc(Cl)c(CN2CC3CCCCN3c3ncc(F)cc3S2(=O)=O)c1
InChI Key InChIKey=ZKYDGDJQXQMWFH-IAXKEJLGSA-N
Data  2 Kd
  Tab Delimited (TSV)   2D SDfile   Computed 3D by Vconf -m prep SDfile
Find this compound or compounds like it in BindingDB:
Activity Spreadsheet -- Enzyme Inhibition Constant Data from BindingDB
Found 2 hits for monomerid = 486659
TargetKelch-like ECH-associated protein 1 [321-624](Homo sapiens (Human))
Janssen Pharmaceutica
US Patent
LigandPNGBDBM486659(US10947252, Example 94 | US11427601, Example 94)
Affinity DataKd: <1nM. Assay description: The details of the KEAP1 KELCH ThermoFluorŪ Assay Construct are as follows: Kelch domain of human KEAP 1 (321-624 aa) was used in the assay. The prot...
Ligand InfoPC cidPC sid
TargetKelch-like ECH-associated protein 1/Nuclear factor erythroid 2-related factor 2(Homo sapiens (Human))
Janssen Pharmaceutica
US Patent
LigandPNGBDBM486659(US10947252, Example 94 | US11427601, Example 94)
Affinity DataKd: <1nM. Assay description: The ThermoFluorŪ is a fluorescence based assay (Tf) that estimates ligand binding affinities by measuring the effect of a ligand on protein thermal s...
Ligand InfoPC cidPC sid
In DepthDetails US Patent