BDBM486695 US10947252, Example 138::US11427601, Example 138
SMILES CCn1nnc2c(C)c(ccc12)C(CC(O)=O)c1ccc(C)c(CN2C[C@@H]3COCCN3c3ncccc3S2(=O)=O)c1
InChI Key InChIKey=MCNYDHMNNGQZKU-XQZUBTRRSA-N
Data  2 Kd
  Tab Delimited (TSV)   2D SDfile   Computed 3D by Vconf -m prep SDfile
Find this compound or compounds like it in BindingDB:
Activity Spreadsheet -- Enzyme Inhibition Constant Data from BindingDB
Found 2 hits for monomerid = 486695
TargetKelch-like ECH-associated protein 1 [321-624](Homo sapiens (Human))
Janssen Pharmaceutica
US Patent
LigandPNGBDBM486695(US10947252, Example 138 | US11427601, Example 138)
Affinity DataKd: <1nM. Assay description: The details of the KEAP1 KELCH ThermoFluorŪ Assay Construct are as follows: Kelch domain of human KEAP 1 (321-624 aa) was used in the assay. The prot...
Ligand InfoPC cidPC sid
TargetKelch-like ECH-associated protein 1/Nuclear factor erythroid 2-related factor 2(Homo sapiens (Human))
Janssen Pharmaceutica
US Patent
LigandPNGBDBM486695(US10947252, Example 138 | US11427601, Example 138)
Affinity DataKd: <1nM. Assay description: The ThermoFluorŪ is a fluorescence based assay (Tf) that estimates ligand binding affinities by measuring the effect of a ligand on protein thermal s...
Ligand InfoPC cidPC sid
In DepthDetails US Patent