BDBM488165 2-(5-(cyclopropylmethyl)-4- (3-fluoro-4-sulfamoylbenzyl)-3- (3-((5-methyloxazol-2- yl)ethynyl)phenyl)-1H-pyrazol-1- yl)thiazole-4-carboxylic acid::US10954228, Compound 122
SMILES Cc1cnc(o1)C#Cc1cccc(c1)-c1nn(c(CC2CC2)c1Cc1ccc(c(F)c1)[SH+](N)=O)-c1nc(cs1)C(O)=O
InChI Key InChIKey=DIQKRUFWQJIDNP-UHFFFAOYSA-O
Data  1 IC50
  Tab Delimited (TSV)   2D SDfile   Computed 3D by Vconf -m prep SDfile
Find this compound or compounds like it in BindingDB:
Activity Spreadsheet -- Enzyme Inhibition Constant Data from BindingDB
Found 1 hit for monomerid = 488165
TargetL-lactate dehydrogenase A chain(Homo sapiens (Human))
The Trustees of The University of Pennsylvania
US Patent
LigandPNGBDBM488165(2-(5-(cyclopropylmethyl)-4- (3-fluoro-4-sulfamoylb...)
Affinity DataIC50: <100nM. Assay description: Test compounds were placed in a Greiner Bio-One (Monroe, N.C.) 1536-well black solid bottom assay plate. 200 millimolar (mM) Tris HCl, pH 7.4, 100 mi...
Ligand InfoPC cidPC sid
In DepthDetails US Patent