BDBM488203 2-(5-(cyclopropylmethyl)-3-(4-fluoro-3- (6-isopropyl-2,6-diazaspiro[3.3] heptan-2-yl)phenyl)-4-(3- fluoro-4-sulfamoylbenzyl)-1H- pyrazol-1-yl)thiazole-4- carboxylic acid; 1H-NMR (MeOD) 948; acid::US10954228, Compound 158
SMILES CC(C)N1CC2(C1)CN(C2)c1cc(ccc1F)-c1nn(c(CC2CC2)c1Cc1ccc(c(F)c1)[SH+](N)=O)-c1nc(cs1)C(O)=O
InChI Key InChIKey=MRYYTSZJDICHKG-UHFFFAOYSA-O
Data  1 IC50
  Tab Delimited (TSV)   2D SDfile   Computed 3D by Vconf -m prep SDfile
Find this compound or compounds like it in BindingDB:
Activity Spreadsheet -- Enzyme Inhibition Constant Data from BindingDB
Found 1 hit for monomerid = 488203
TargetL-lactate dehydrogenase A chain(Homo sapiens (Human))
The Trustees of The University of Pennsylvania
US Patent
LigandPNGBDBM488203(2-(5-(cyclopropylmethyl)-3-(4-fluoro-3- (6-isoprop...)
Affinity DataIC50: <100nM. Assay description: Test compounds were placed in a Greiner Bio-One (Monroe, N.C.) 1536-well black solid bottom assay plate. 200 millimolar (mM) Tris HCl, pH 7.4, 100 mi...
Ligand InfoPC cidPC sid
In DepthDetails US Patent