BDBM488204 2-(5-(cyclopropylmethyl)-3-(4- fluoro-3-(1H-imidazol- 2-yl)phenyl)-4-(3-fluoro-4- sulfamoylbenzyl)-1H- pyrazol-1-yl)thiazole-4-carboxylic acid::US10954228, Compound 159
SMILES N[S+]([O-])(=O)c1ccc(Cc2c(CC3CC3)n(nc2-c2ccc(F)c(c2)-c2ncc[nH]2)-c2nc(cs2)C(O)=O)cc1F
InChI Key InChIKey=RCLNNXYUYRRSBA-UHFFFAOYSA-N
Data  1 IC50
  Tab Delimited (TSV)   2D SDfile   Computed 3D by Vconf -m prep SDfile
Find this compound or compounds like it in BindingDB:
Activity Spreadsheet -- Enzyme Inhibition Constant Data from BindingDB
Found 1 hit for monomerid = 488204
TargetL-lactate dehydrogenase A chain(Homo sapiens (Human))
The Trustees of The University of Pennsylvania
US Patent
LigandPNGBDBM488204(2-(5-(cyclopropylmethyl)-3-(4- fluoro-3-(1H-imidaz...)
Affinity DataIC50: <100nM. Assay description: Test compounds were placed in a Greiner Bio-One (Monroe, N.C.) 1536-well black solid bottom assay plate. 200 millimolar (mM) Tris HCl, pH 7.4, 100 mi...
Ligand InfoPC cidPC sid
In DepthDetails US Patent