BDBM489223 US10961233, Example 84
SMILES Nc1nc(co1)C(=O)Nc1c(Br)cccc1N1CCN(CC1)S(=O)(=O)C1CCNCC1
InChI Key InChIKey=XOLIETIBHLQESP-UHFFFAOYSA-N
Data  1 IC50
  Tab Delimited (TSV)   2D SDfile   Computed 3D by Vconf -m prep SDfile
Find this compound or compounds like it in BindingDB:
Activity Spreadsheet -- Enzyme Inhibition Constant Data from BindingDB
Found 1 hit for monomerid = 489223
LigandPNGBDBM489223(US10961233, Example 84)
Affinity DataIC50: <10nM. Assay description: 5 μl WT full length PAICS (final assay concentration, fac, 2.5 nM) in basic buffer, added to black, non-binding, 384-well plates (Corning #3575)...
Ligand InfoPC cidPC sid
In DepthDetails US Patent