BDBM489485 US10961232, Compound IA-154
SMILES CC(C)Sc1ccc(cc1)-c1cnc(N)c(n1)-c1nnc(o1)-c1cccc(c1)C(C)NC(=O)OC(C)(C)C
InChI Key InChIKey=SJGYMNRTGKBCBM-UHFFFAOYSA-N
Data  1 KI
  Tab Delimited (TSV)   2D SDfile   Computed 3D by Vconf -m prep SDfile
Find this compound or compounds like it in BindingDB:
Activity Spreadsheet -- Enzyme Inhibition Constant Data from BindingDB
Found 1 hit for monomerid = 489485
TargetSerine/threonine-protein kinase ATR(Homo sapiens (Human))
Vertex Pharmaceuticals
US Patent
LigandPNGBDBM489485(US10961232, Compound IA-154)
Affinity DataKi: <10nM. Assay description: Compounds were screened for their ability to inhibit ATR kinase using a radioactive-phosphate incorporation assay. Assays were carried out in a mixtu...
Ligand InfoPC cidPC sid
In DepthDetails US Patent