BDBM492875 N-((5-chloro-1H- indazol-3-yl)methyl)-5- (4- methylbenzyl) nicotinamide::US10981893, Example 4
SMILES Cc1ccc(Cc2cncc(c2)C(=O)NCc2n[nH]c3ccc(Cl)cc23)cc1
InChI Key InChIKey=GYTIAVJQNUGOPW-UHFFFAOYSA-N
Data  1 IC50
  Tab Delimited (TSV)   2D SDfile   Computed 3D by Vconf -m prep SDfile
Find this compound or compounds like it in BindingDB:
Activity Spreadsheet -- Enzyme Inhibition Constant Data from BindingDB
Found 1 hit for monomerid = 492875
TargetPlasma kallikrein(Homo sapiens (Human))
Attune Pharmaceuticals
US Patent
LigandPNGBDBM492875(N-((5-chloro-1H- indazol-3-yl)methyl)-5- (4- methy...)
Affinity DataIC50:  5.50E+3nM. Assay description: The ability of the compounds disclosed herein to inhibit human plasma kallikrein activity was quantified according to the procedures below.A 10 mM so...
Ligand InfoPC cidPC sid
In DepthDetails US Patent