BDBM492877 5-(2-carbamoylbenzyl)- N-((5-chloro-1H- indazol-3- yl)methyl)nicotinamide::US10981893, Example 6
SMILES NC(=O)c1ccccc1Cc1cncc(c1)C(=O)NCc1n[nH]c2ccc(Cl)cc12
InChI Key InChIKey=ZITGZLAGIRUYRB-UHFFFAOYSA-N
Data  1 IC50
  Tab Delimited (TSV)   2D SDfile   Computed 3D by Vconf -m prep SDfile
Find this compound or compounds like it in BindingDB:
Activity Spreadsheet -- Enzyme Inhibition Constant Data from BindingDB
Found 1 hit for monomerid = 492877
TargetPlasma kallikrein(Homo sapiens (Human))
Attune Pharmaceuticals
US Patent
LigandPNGBDBM492877(5-(2-carbamoylbenzyl)- N-((5-chloro-1H- indazol-3-...)
Affinity DataIC50:  5.50E+3nM. Assay description: The ability of the compounds disclosed herein to inhibit human plasma kallikrein activity was quantified according to the procedures below.A 10 mM so...
Ligand InfoPC cidPC sid
In DepthDetails US Patent