BDBM492883 2-(5-chloro-1H-indazol- 3-yl)-2-(5-(4-((2- oxopyridin-1(2H)- yl)methyl)benzyl) nicotinamido)acetic acid::US10981893, Example 12
SMILES OC(=O)C(NC(=O)c1cncc(Cc2ccc(Cn3ccccc3=O)cc2)c1)c1n[nH]c2ccc(Cl)cc12
InChI Key
Data  1 IC50
  Tab Delimited (TSV)   2D SDfile   Computed 3D by Vconf -m prep SDfile
Find this compound or compounds like it in BindingDB:
Activity Spreadsheet -- Enzyme Inhibition Constant Data from BindingDB
Found 1 hit for monomerid = 492883
TargetPlasma kallikrein(Homo sapiens (Human))
Attune Pharmaceuticals
US Patent
LigandPNGBDBM492883(2-(5-chloro-1H-indazol- 3-yl)-2-(5-(4-((2- oxopyri...)
Affinity DataIC50:  5.50E+3nM. Assay description: The ability of the compounds disclosed herein to inhibit human plasma kallikrein activity was quantified according to the procedures below.A 10 mM so...
Ligand InfoPC cidPC sid
In DepthDetails US Patent