BDBM493415 US10981917, Example 116
SMILES CCOC(=O)c1cc(cn1C)-c1cc(Cl)cc2ncn(CCC[C@H]3NCCC[C@@H]3O)c12
InChI Key InChIKey=DNYKZWYJUNNHRM-NQIIRXRSSA-N
Data  1 IC50
  Tab Delimited (TSV)   2D SDfile   Computed 3D by Vconf -m prep SDfile
Find this compound or compounds like it in BindingDB:
Activity Spreadsheet -- Enzyme Inhibition Constant Data from BindingDB
Found 1 hit for monomerid = 493415
TargetRibose-phosphate pyrophosphokinase 1(Homo sapiens (Human))
Daewoong Pharmaceutical
US Patent
LigandPNGBDBM493415(US10981917, Example 116)
Affinity DataIC50: <100nM. Assay description: In order to confirm the biological activities of the compounds prepared in Examples, % inhibition or IC50 values of PRS enzyme (phosphoribosylpyropho...
Ligand InfoPC cidPC sid
In DepthDetails US Patent