BDBM493448 US10981917, Example 149
SMILES COC(=O)c1cn(CCC[C@H]2NCCC[C@@H]2O)c2c(Br)cccc12
InChI Key InChIKey=BLQHYWPNOGKDKO-CVEARBPZSA-N
Data  1 IC50
  Tab Delimited (TSV)   2D SDfile   Computed 3D by Vconf -m prep SDfile
Find this compound or compounds like it in BindingDB:
Activity Spreadsheet -- Enzyme Inhibition Constant Data from BindingDB
Found 1 hit for monomerid = 493448
TargetRibose-phosphate pyrophosphokinase 1(Homo sapiens (Human))
Daewoong Pharmaceutical
US Patent
LigandPNGBDBM493448(US10981917, Example 149)
Affinity DataIC50:  300nM. Assay description: In order to confirm the biological activities of the compounds prepared in Examples, % inhibition or IC50 values of PRS enzyme (phosphoribosylpyropho...
Ligand InfoPC cidPC sid
In DepthDetails US Patent