BDBM493719 US10988451, Example 189
SMILES CO[C@H]1\C=C\C[C@H](C)C[S@@](=O)(NC(=O)C2C[C@H](CO)C2)=NC(=O)c2ccc3OC[C@]4(CCCc5cc(Cl)ccc45)CN(C[C@@H]4CC[C@@H]14)c3c2
InChI Key InChIKey=OIPWJOMEIIEDNE-OISRFSOJSA-N
Data  1 IC50
  Tab Delimited (TSV)   2D SDfile   Computed 3D by Vconf -m prep SDfile
Find this compound or compounds like it in BindingDB:
Activity Spreadsheet -- Enzyme Inhibition Constant Data from BindingDB
Found 1 hit for monomerid = 493719
TargetInduced myeloid leukemia cell differentiation protein Mcl-1 [171-327](Homo sapiens (Human))
Gilead Sciences
US Patent
LigandPNGBDBM493719(US10988451, Example 189)
Affinity DataIC50:  0.0330nM. Assay description: The AlphaLISA assay was performed in a 384-well Proxiplate in a total volume of 40 μL. The reaction mixture contained 0.0625 nM 6× His-Mcl-1 (17...
Ligand InfoPC cidPC sid
In DepthDetails US Patent