BDBM494003 US10988481, Compound 3
SMILES Oc1ccc2C[C@H]3N(CC4CC4)CC[C@@]45[C@@H](Oc1c24)[C@H](CC[C@@]35O)NC(=O)c1cccc2[nH]ccc12
InChI Key
Data  3 KI
  Tab Delimited (TSV)   2D SDfile   Computed 3D by Vconf -m prep SDfile
Find this compound or compounds like it in BindingDB:
Activity Spreadsheet -- Enzyme Inhibition Constant Data from BindingDB
Found 3 hits for monomerid = 494003
TargetMu-type opioid receptor(Homo sapiens (Human))
Virginia Commonwealth University
US Patent
LigandPNGBDBM494003(US10988481, Compound 3)
Affinity DataKi:  0.264nM. Assay description: The competition binding assay was conducted to determine the affinity and selectivity of the synthesized compounds to MOR over KOR and DOR. The Kd an...
Ligand InfoPC cidPC sid
In DepthDetails US Patent
TargetKappa-type opioid receptor(Homo sapiens (Human))
Virginia Commonwealth University
US Patent
LigandPNGBDBM494003(US10988481, Compound 3)
Affinity DataKi:  1.49nM. Assay description: The competition binding assay was conducted to determine the affinity and selectivity of the synthesized compounds to MOR over KOR and DOR. The Kd an...
Ligand InfoPC cidPC sid
In DepthDetails US Patent
TargetDelta-type opioid receptor(Homo sapiens (Human))
Virginia Commonwealth University
US Patent
LigandPNGBDBM494003(US10988481, Compound 3)
Affinity DataKi:  9.26nM. Assay description: The competition binding assay was conducted to determine the affinity and selectivity of the synthesized compounds to MOR over KOR and DOR. The Kd an...
Ligand InfoPC cidPC sid
In DepthDetails US Patent