BDBM494127 US10988481, Compound 12
SMILES Oc1ccc2C[C@H]3N(CC[C@@]45C(Oc1c24)[C@@H](CC[C@@]35O)NC(=O)c1cccc2[nH]ccc12)C1CC1
InChI Key
Data  3 KI
  Tab Delimited (TSV)   2D SDfile   Computed 3D by Vconf -m prep SDfile
Find this compound or compounds like it in BindingDB:
Activity Spreadsheet -- Enzyme Inhibition Constant Data from BindingDB
Found 3 hits for monomerid = 494127
TargetMu-type opioid receptor(Homo sapiens (Human))
Virginia Commonwealth University
US Patent
LigandPNGBDBM494127(US10988481, Compound 12)
Affinity DataKi:  0.235nM. Assay description: The competition binding assay was conducted to determine the affinity and selectivity of the synthesized compounds to MOR over KOR and DOR. The Kd an...
Ligand InfoPC cidPC sid
In DepthDetails US Patent
TargetKappa-type opioid receptor(Homo sapiens (Human))
Virginia Commonwealth University
US Patent
LigandPNGBDBM494127(US10988481, Compound 12)
Affinity DataKi:  1.94nM. Assay description: The competition binding assay was conducted to determine the affinity and selectivity of the synthesized compounds to MOR over KOR and DOR. The Kd an...
Ligand InfoPC cidPC sid
In DepthDetails US Patent
TargetDelta-type opioid receptor(Homo sapiens (Human))
Virginia Commonwealth University
US Patent
LigandPNGBDBM494127(US10988481, Compound 12)
Affinity DataKi:  45.9nM. Assay description: The competition binding assay was conducted to determine the affinity and selectivity of the synthesized compounds to MOR over KOR and DOR. The Kd an...
Ligand InfoPC cidPC sid
In DepthDetails US Patent