BDBM49576 2-(4-aminophenyl)-1,3-benzothiazole-6-carboxylic acid::MLS000585902::SMR000207683::cid_3665766
SMILES Nc1ccc(cc1)-c1nc2ccc(cc2s1)C(O)=O
InChI Key InChIKey=LTPKGLBZIVLTAJ-UHFFFAOYSA-N
Data  2 IC50  1 EC50
  Tab Delimited (TSV)   2D SDfile   Computed 3D by Vconf -m prep SDfile
Find this compound or compounds like it in BindingDB:
Activity Spreadsheet -- Enzyme Inhibition Constant Data from BindingDB
Found 3 hits for monomerid = 49576
TargetTranscription factor p65(Homo sapiens (Human))
Srmlsc
Curated by PubChem BioAssay
LigandPNGBDBM49576(2-(4-aminophenyl)-1,3-benzothiazole-6-carboxylic a...)
Affinity DataEC50:  146nM. Assay description: Southern Research Molecular Libraries Screening Center (SRMLSC) Southern Research Institute (Birmingham, Alabama) NIH Molecular Libraries Screening C...
In DepthDetails PCBioAssay
TargetM1 family aminopeptidase(Plasmodium falciparum (isolate FcB1 / Columbia))
Srmlsc
Curated by PubChem BioAssay
LigandPNGBDBM49576(2-(4-aminophenyl)-1,3-benzothiazole-6-carboxylic a...)
Affinity DataIC50:  2.57E+4nM. Assay description: Southern Research Molecular Libraries Screening Center (SRMLSC) Southern Research Institute (Birmingham, Alabama) NIH Molecular Libraries Screening...
In DepthDetails PCBioAssay
TargetGlycoprotein 42(Human herpesvirus 4 type 2)
Emory University
Curated by PubChem BioAssay
LigandPNGBDBM49576(2-(4-aminophenyl)-1,3-benzothiazole-6-carboxylic a...)
Affinity DataIC50:  5.40E+4nM. Assay description: NIH Molecular Libraries Screening Centers Network [MLSCN] Emory Chemical Biology Discovery Center in MLSCN Assay provider: Theodore Jardetzky; Northw...
In DepthDetails PCBioAssay